hanahanahunachi’s diary

Android studio でお勉強してます。

databindingのerrorで毎回詰まってる話

Ⅰ.変数名のspellmiss

Ⅱ.ぽえええええ 原因が分かんないタイプのbuild errorぢゃん!

error文は以下の通り 

:app:kaptDebugKotlin
e: java.lang.IllegalStateException: failed to analyze: java.lang.annotation.IncompleteAnnotationException: android.databinding.BindingBuildInfo missing element enableDebugLogs
at org.jetbrains.kotlin.analyzer.AnalysisResult.throwIfError(AnalysisResult.kt:57)
at org.jetbrains.kotlin.cli.jvm.compiler.KotlinToJVMBytecodeCompiler.compileModules(KotlinToJVMBytecodeCompiler.kt:144)
at org.jetbrains.kotlin.cli.jvm.K2JVMCompiler.doExecute(K2JVMCompiler.kt:167)
at org.jetbrains.kotlin.cli.jvm.K2JVMCompiler.doExecute(K2JVMCompiler.kt:55)
at org.jetbrains.kotlin.cli.common.CLICompiler.exec(CLICompiler.java:182)
at org.jetbrains.kotlin.daemon.CompileServiceImpl.execCompiler(CompileServiceImpl.kt:397)
at org.jetbrains.kotlin.daemon.CompileServiceImpl.access$execCompiler(CompileServiceImpl.kt:99)
at org.jetbrains.kotlin.daemon.CompileServiceImpl$compile$1$2.invoke(CompileServiceImpl.kt:365)
at org.jetbrains.kotlin.daemon.CompileServiceImpl$compile$1$2.invoke(CompileServiceImpl.kt:99)
at org.jetbrains.kotlin.daemon.CompileServiceImpl$doCompile$2$$special$$inlined$withValidClientOrSessionProxy$lambda$1.invoke(CompileServiceImpl.kt:798)
at org.jetbrains.kotlin.daemon.CompileServiceImpl$doCompile$2$$special$$inlined$withValidClientOrSessionProxy$lambda$1.invoke(CompileServiceImpl.kt:99)
at org.jetbrains.kotlin.daemon.common.DummyProfiler.withMeasure(PerfUtils.kt:137)
at org.jetbrains.kotlin.daemon.CompileServiceImpl.checkedCompile(CompileServiceImpl.kt:825)
at org.jetbrains.kotlin.daemon.CompileServiceImpl.access$checkedCompile(CompileServiceImpl.kt:99)
at org.jetbrains.kotlin.daemon.CompileServiceImpl$doCompile$2.invoke(CompileServiceImpl.kt:797)
at org.jetbrains.kotlin.daemon.CompileServiceImpl$doCompile$2.invoke(CompileServiceImpl.kt:99)
at org.jetbrains.kotlin.daemon.CompileServiceImpl.ifAlive(CompileServiceImpl.kt:1004)
at org.jetbrains.kotlin.daemon.CompileServiceImpl.ifAlive$default(CompileServiceImpl.kt:865)
at org.jetbrains.kotlin.daemon.CompileServiceImpl.doCompile(CompileServiceImpl.kt:791)
at org.jetbrains.kotlin.daemon.CompileServiceImpl.access$doCompile(CompileServiceImpl.kt:99)
at org.jetbrains.kotlin.daemon.CompileServiceImpl$compile$1.invoke(CompileServiceImpl.kt:364)
at org.jetbrains.kotlin.daemon.CompileServiceImpl$compile$1.invoke(CompileServiceImpl.kt:99)
at org.jetbrains.kotlin.daemon.CompileServiceImpl.ifAlive(CompileServiceImpl.kt:1004)
at org.jetbrains.kotlin.daemon.CompileServiceImpl.ifAlive$default(CompileServiceImpl.kt:865)
at org.jetbrains.kotlin.daemon.CompileServiceImpl.compile(CompileServiceImpl.kt:336)
at sun.reflect.NativeMethodAccessorImpl.invoke0(Native Method)
at sun.reflect.NativeMethodAccessorImpl.invoke(NativeMethodAccessorImpl.java:62)
at sun.reflect.DelegatingMethodAccessorImpl.invoke(DelegatingMethodAccessorImpl.java:43)
at java.lang.reflect.Method.invoke(Method.java:498)
at sun.rmi.server.UnicastServerRef.dispatch(UnicastServerRef.java:324)
at sun.rmi.transport.Transport$1.run(Transport.java:200)
at sun.rmi.transport.Transport$1.run(Transport.java:197)
at java.security.AccessController.doPrivileged(Native Method)
at sun.rmi.transport.Transport.serviceCall(Transport.java:196)
at sun.rmi.transport.tcp.TCPTransport.handleMessages(TCPTransport.java:568)
at sun.rmi.transport.tcp.TCPTransport$ConnectionHandler.run0(TCPTransport.java:826)
at sun.rmi.transport.tcp.TCPTransport$ConnectionHandler.lambda$run$0(TCPTransport.java:683)
at java.security.AccessController.doPrivileged(Native Method)
at sun.rmi.transport.tcp.TCPTransport$ConnectionHandler.run(TCPTransport.java:682)
at java.util.concurrent.ThreadPoolExecutor.runWorker(ThreadPoolExecutor.java:1142)
at java.util.concurrent.ThreadPoolExecutor$Worker.run(ThreadPoolExecutor.java:617)
at java.lang.Thread.run(Thread.java:745)
Caused by: java.lang.annotation.IncompleteAnnotationException: android.databinding.BindingBuildInfo missing element enableDebugLogs
at sun.reflect.annotation.AnnotationInvocationHandler.invoke(AnnotationInvocationHandler.java:81)
at com.sun.proxy.$Proxy32.enableDebugLogs(Unknown Source)
at android.databinding.annotationprocessor.BuildInfoUtil.load(BuildInfoUtil.java:35)
at android.databinding.annotationprocessor.ProcessDataBinding.process(ProcessDataBinding.java:59)
at com.sun.tools.javac.processing.JavacProcessingEnvironment.callProcessor(JavacProcessingEnvironment.java:794)
at com.sun.tools.javac.processing.JavacProcessingEnvironment.discoverAndRunProcs(JavacProcessingEnvironment.java:705)
at com.sun.tools.javac.processing.JavacProcessingEnvironment.access$1800(JavacProcessingEnvironment.java:91)
at com.sun.tools.javac.processing.JavacProcessingEnvironment$Round.run(JavacProcessingEnvironment.java:1035)
at com.sun.tools.javac.processing.JavacProcessingEnvironment.doProcessing(JavacProcessingEnvironment.java:1176)
at com.sun.tools.javac.main.JavaCompiler.processAnnotations(JavaCompiler.java:1170)
at com.sun.tools.javac.main.JavaCompiler.processAnnotations(JavaCompiler.java:1068)
at org.jetbrains.kotlin.kapt3.AnnotationProcessingKt.doAnnotationProcessing(annotationProcessing.kt:73)
at org.jetbrains.kotlin.kapt3.AnnotationProcessingKt.doAnnotationProcessing$default(annotationProcessing.kt:42)
at org.jetbrains.kotlin.kapt3.AbstractKapt3Extension.runAnnotationProcessing(Kapt3Extension.kt:205)
at org.jetbrains.kotlin.kapt3.AbstractKapt3Extension.analysisCompleted(Kapt3Extension.kt:166)
at org.jetbrains.kotlin.kapt3.ClasspathBasedKapt3Extension.analysisCompleted(Kapt3Extension.kt:82)
at org.jetbrains.kotlin.resolve.jvm.TopDownAnalyzerFacadeForJVM$analyzeFilesWithJavaIntegration$2.invoke(TopDownAnalyzerFacadeForJVM.kt:89)
at org.jetbrains.kotlin.resolve.jvm.TopDownAnalyzerFacadeForJVM.analyzeFilesWithJavaIntegration(TopDownAnalyzerFacadeForJVM.kt:99)
at org.jetbrains.kotlin.resolve.jvm.TopDownAnalyzerFacadeForJVM.analyzeFilesWithJavaIntegration$default(TopDownAnalyzerFacadeForJVM.kt:76)
at org.jetbrains.kotlin.cli.jvm.compiler.KotlinToJVMBytecodeCompiler$analyze$1.analyze(KotlinToJVMBytecodeCompiler.kt:365)
at org.jetbrains.kotlin.cli.common.messages.AnalyzerWithCompilerReport.analyzeAndReport(AnalyzerWithCompilerReport.kt:105)
at org.jetbrains.kotlin.cli.jvm.compiler.KotlinToJVMBytecodeCompiler.analyze(KotlinToJVMBytecodeCompiler.kt:354)
at org.jetbrains.kotlin.cli.jvm.compiler.KotlinToJVMBytecodeCompiler.compileModules(KotlinToJVMBytecodeCompiler.kt:139)
... 40 more


FAILED

FAILURE: Build failed with an exception.

* What went wrong:
Execution failed for task ':app:kaptDebugKotlin'.
> Internal compiler error. See log for more details

 

ライブラリのversion問題だった in plagin

apply plugin: 'kotlin-kapt'
kapt 'com.android.databinding:compiler:2.3.3'

 compiler:2.3.3になってるか今すぐ確認しよう!versionが古いと死ねぞ!